{"text_format":"1","workbook":"xlsx","n_sheets":12,"sheets":["Instructions","Definitions","Unauthorised transactions","^Commentary to 'Other' channel","Complaints","A. Card UTs","B. Banking UTs","C. Other UTs","D. Complaints by timeframe","E. Complaints by reason","F. Totals","ABN check"],"not_rendered":{"charts":0,"images":1,"macros":1,"external_links":0,"defined_names":0,"comments":0,"pivot_tables":0},"unopened":[],"bounds":{"document_bytes":16777216,"sheet_cells":100000,"rows_first":2000,"rows_last":500,"rows_between":2000,"halvings":0,"cell_chars":16384,"cell_head_chars":4096},"cells_cut":0,"cells_raw":0,"read":"whole","date_system":"1900"}

{"sheet":"Instructions","index":0,"n_rows":34,"n_cols":14,"rows_kept":34,"cut":false,"hidden":false,"merged":[[30,2,31,2],[13,2,13,3]]}
[]
[]
[null,null,"ePayments Code Compliance Reporting",null,{"$f":"IF(OR(E16<>\"\",E18<>\"\",E20<>\"\",F26<>\"\",F27<>\"\",F28<>\"\",D26<>\"OK\",D27<>\"OK\",D28<>\"OK\",D30<>\"\",D33<>\"\",D34<>\"\",'Unauthorised transactions'!Z5<>0,Complaints!Z6<>0),\"Your submission may contain errors. Please check error messages before submitting.\",\"\")","v":"Your submission may contain errors. Please check error messages before submitting."}]
[]
[null,null,"The data collection period starts on 1 January 2017 and ends on 31 December 2017. The report needs to be lodged with ASIC by 1 March 2018"]
[]
[null,null,"ASIC has provided guidance for this report on its website (Information Sheet 195)"]
[null,null,"Please read these instructions prior to completing the spreadsheet to ensure that it is completed correctly. "]
[null,null," All cells are to be completed. No cells should be left blank. For numerical entries enter numbers only and whole amounts, e.g. not $M or $'000s."]
[]
{"$rows_left_out":25}
{"sheet":"Definitions","index":1,"n_rows":46,"n_cols":3,"rows_kept":46,"cut":false,"hidden":false,"merged":[]}
["DEFINITIONS"]
[]
["Channels - Credit and Debit Card Initiated Unauthorised Transactions",null,"Examples of transaction "]
["ATM","Payment channel using an automated teller machine.","Cash withdrawals, deposits, money transfers between linked accounts, payments to other accounts."]
["POS","Point of sale channel for credit and debit card transactions, for face-to-face and remote payments.","Credit / debit card transactions made face-to-face, mail order, telephone order and over the internet."]
[]
[]
["Channels - Internet Banking and Telephone Banking (non-cards) Unauthorised Transactions",null,"Examples of transaction "]
["Internet banking ","Retail banking self-service channel available using an internet browser, direct to user.","PayAnyone, BPAY transactions made using internet banking facility accessed via the subscriber's website."]
["Mobile applications banking","Retail self-service banking channel accessed using a dedicated mobile application from a smart-phone or other mobile device, direct to user.","PayAnyone, BPAY transactions made using a dedicated mobile application from a smart-phone or other mobile device.  Does not include internet banking transactions (made using smart-phone or other mobile device) where the user is accessing the facility via a website."]
{"$rows_left_out":37}
{"sheet":"Unauthorised transactions","index":2,"n_rows":64,"n_cols":26,"rows_kept":64,"cut":false,"hidden":false,"merged":[[5,1,5,5],[7,4,7,5],[24,1,24,13],[26,2,26,7],[26,8,26,13],[8,2,8,3],[26,14,26,15],[27,2,27,3],[27,4,27,5],[27,6,27,7],[27,8,27,9],[27,10,27,11],[27,12,27,13],[27,14,27,15],[44,8,44,9],[44,6,44,7],[44,4,44,5],[44,2,44,3],[42,1,42,13],[44,10,44,11]]}
[]
[null,"Please enter numbers only and whole amounts, e.g. not $M or $'000s"]
[]
[null,{"$f":"Instructions!$E$3","v":"Your submission may contain errors. Please check error messages before submitting."}]
[null,null,null,null,null,null,null,null,null,null,null,null,null,null,null,null,null,null,null,null,null,null,null,null,null,{"$f":"SUM(Z11:Z64)","v":44}]
[null,"A. Credit and Debit Card Initiated Unauthorised Transactions"]
[null,null,{"$f":"IF($Z10<>0,\"ERROR: All cells are to be completed. No cell should be left blank\",\"\")","v":"ERROR: All cells are to be completed. No cell should be left blank"}]
[null,null,"POS (includes remote",null,"ATM"]
[null,null,"transactions)"]
[null,null,"#","$","#","$",null,null,null,null,null,null,null,null,null,null,null,null,null,null,null,null,null,null,null,{"$f":"SUM(Z11:Z19)","v":8}]
{"$rows_left_out":55}
{"sheet":"^Commentary to 'Other' channel","index":3,"n_rows":3,"n_cols":2,"rows_kept":3,"cut":false,"hidden":false,"merged":[]}
["^ If you use the 'Other' payment channel category in Table C:"]
[]
["Payment facility included in 'Other'","Corresponding reason(s) why the facility is captured under this category"]

{"sheet":"Complaints","index":4,"n_rows":42,"n_cols":27,"rows_kept":42,"cut":false,"hidden":false,"merged":[[8,12,8,13],[8,14,8,15],[8,16,8,17],[8,18,8,19],[22,12,22,13],[22,14,22,15],[22,16,22,17],[22,18,22,19],[6,1,6,11],[8,2,8,3],[8,4,8,5],[8,8,8,9],[8,10,8,11],[8,6,8,7],[16,1,16,3],[17,1,17,3],[20,1,20,11],[22,2,22,3],[22,4,22,5],[22,8,22,9],[22,10,22,11],[22,6,22,7]]}
[null,null,{"$f":"Instructions!$E$3","v":"Your submission may contain errors. Please check error messages before submitting."},null,null,null,null,null,null,null,null,null,null,null,null,null,null,null,null,null,null,null,null,null,null,null,"Included"]
[null,null,null,null,null,null,null,null,null,null,null,null,null,null,null,null,null,null,null,null,null,null,null,null,null,null,"Excluded"]
[null,"NOTE: A complaint is an expression of dissatisfaction made to an organisation, related to its products or services, or the complaints handling process itself, where a response or resolution is explicitly or implicitly implied. "]
[null,"In the context of this report, a complaint does not include a report/claim by a user that an unauthorised transaction has occurred. Rather, our interest is in complaints made about a subscriber's handling of, or response to, a report/claim."]
[null,"Please enter the total number of instances and not the dollar amounts of the complaints in Table D and Table E.  Please indicate your response in cell D18."]
[null,null,null,null,null,null,null,null,null,null,null,null,null,null,null,null,null,null,null,null,null,null,null,null,null,{"$f":"SUM(Z10:Z26)","v":10}]
[null,"D. Unauthorised Transaction Complaints By Timeframe"]
[null,null,"Please enter the total number of instances and not the dollar amounts of the complaints.",null,null,null,null,null,null,{"$f":"IF($Z10<>0,\"ERROR: All cells are to be completed. No cell should be left blank\",\"\")","v":"ERROR: All cells are to be completed. No cell should be left blank"}]
[null,null,"Internet Banking",null,"Telephone Banking",null,"Mobile App Banking",null,"POS (includes remote transactions)",null,"ATM",null,"Mobile telco network",null,"Internet",null,"Face-to-face POS",null,"Other "]
[null,null,"Compensation ","No Compensation","Compensation ","No Compensation","Compensation ","No Compensation","Compensation ","No Compensation","Compensation ","No Compensation","Compensation ","No Compensation","Compensation ","No Compensation","Compensation ","No Compensation","Compensation ","No Compensation",null,null,null,null,null,{"$f":"SUM(Z11:Z13)","v":3}]
{"$rows_left_out":33}
{"sheet":"A. Card UTs","index":5,"n_rows":15,"n_cols":7,"rows_kept":15,"cut":false,"hidden":true,"merged":[]}
["Entity Name","Entity Type","Year","POS/ATM","Transaction Type","#","$"]
[{"$f":"Instructions!$D$16","v":"<please enter>"},{"$f":"Instructions!$D$20","v":"<please select>"},{"$f":"Instructions!$D$22","v":2017},"POS","Lost / Stolen",{"$f":"'Unauthorised transactions'!C11","v":0},{"$f":"'Unauthorised transactions'!D11","v":0}]
[{"$f":"Instructions!$D$16","v":"<please enter>"},{"$f":"Instructions!$D$20","v":"<please select>"},{"$f":"Instructions!$D$22","v":2017},"POS","Never Received",{"$f":"'Unauthorised transactions'!C12","v":0},{"$f":"'Unauthorised transactions'!D12","v":0}]
[{"$f":"Instructions!$D$16","v":"<please enter>"},{"$f":"Instructions!$D$20","v":"<please select>"},{"$f":"Instructions!$D$22","v":2017},"POS","Counterfeit / Skimming",{"$f":"'Unauthorised transactions'!C13","v":0},{"$f":"'Unauthorised transactions'!D13","v":0}]
[{"$f":"Instructions!$D$16","v":"<please enter>"},{"$f":"Instructions!$D$20","v":"<please select>"},{"$f":"Instructions!$D$22","v":2017},"POS","Fraudulent Application",{"$f":"'Unauthorised transactions'!C14","v":0},{"$f":"'Unauthorised transactions'!D14","v":0}]
[{"$f":"Instructions!$D$16","v":"<please enter>"},{"$f":"Instructions!$D$20","v":"<please select>"},{"$f":"Instructions!$D$22","v":2017},"POS","Card Not Present (CNP)*",{"$f":"'Unauthorised transactions'!C15","v":0},{"$f":"'Unauthorised transactions'!D15","v":0}]
[{"$f":"Instructions!$D$16","v":"<please enter>"},{"$f":"Instructions!$D$20","v":"<please select>"},{"$f":"Instructions!$D$22","v":2017},"POS","System / Equipment malfunction",{"$f":"'Unauthorised transactions'!C16","v":0},{"$f":"'Unauthorised transactions'!D16","v":0}]
[{"$f":"Instructions!$D$16","v":"<please enter>"},{"$f":"Instructions!$D$20","v":"<please select>"},{"$f":"Instructions!$D$22","v":2017},"POS","Other ",{"$f":"'Unauthorised transactions'!C17","v":0},{"$f":"'Unauthorised transactions'!D17","v":0}]
[{"$f":"Instructions!$D$16","v":"<please enter>"},{"$f":"Instructions!$D$20","v":"<please select>"},{"$f":"Instructions!$D$22","v":2017},"ATM","Lost / Stolen",{"$f":"'Unauthorised transactions'!E11","v":0},{"$f":"'Unauthorised transactions'!F11","v":0}]
[{"$f":"Instructions!$D$16","v":"<please enter>"},{"$f":"Instructions!$D$20","v":"<please select>"},{"$f":"Instructions!$D$22","v":2017},"ATM","Never Received",{"$f":"'Unauthorised transactions'!E12","v":0},{"$f":"'Unauthorised transactions'!F12","v":0}]
{"$rows_left_out":6}
{"sheet":"B. Banking UTs","index":6,"n_rows":42,"n_cols":8,"rows_kept":42,"cut":false,"hidden":true,"merged":[]}
["Entity Name","Entity Type","Year","Channel","Sub-type","Transaction type","#","$"]
[{"$f":"Instructions!$D$16","v":"<please enter>"},{"$f":"Instructions!$D$20","v":"<please select>"},{"$f":"Instructions!$D$22","v":2017},"Internet banking","Pay anyone same FI","Malware",{"$f":"'Unauthorised transactions'!C30","v":0},{"$f":"'Unauthorised transactions'!D30","v":0}]
[{"$f":"Instructions!$D$16","v":"<please enter>"},{"$f":"Instructions!$D$20","v":"<please select>"},{"$f":"Instructions!$D$22","v":2017},"Internet banking","Pay anyone same FI","Phishing",{"$f":"'Unauthorised transactions'!C31","v":0},{"$f":"'Unauthorised transactions'!D31","v":0}]
[{"$f":"Instructions!$D$16","v":"<please enter>"},{"$f":"Instructions!$D$20","v":"<please select>"},{"$f":"Instructions!$D$22","v":2017},"Internet banking","Pay anyone same FI","ID Takeover",{"$f":"'Unauthorised transactions'!C32","v":0},{"$f":"'Unauthorised transactions'!D32","v":0}]
[{"$f":"Instructions!$D$16","v":"<please enter>"},{"$f":"Instructions!$D$20","v":"<please select>"},{"$f":"Instructions!$D$22","v":2017},"Internet banking","Pay anyone same FI","Phone Porting",{"$f":"'Unauthorised transactions'!C33","v":0},{"$f":"'Unauthorised transactions'!D33","v":0}]
[{"$f":"Instructions!$D$16","v":"<please enter>"},{"$f":"Instructions!$D$20","v":"<please select>"},{"$f":"Instructions!$D$22","v":2017},"Internet banking","Pay anyone same FI","System / Equipment malfunction",{"$f":"'Unauthorised transactions'!C34","v":0},{"$f":"'Unauthorised transactions'!D34","v":0}]
[{"$f":"Instructions!$D$16","v":"<please enter>"},{"$f":"Instructions!$D$20","v":"<please select>"},{"$f":"Instructions!$D$22","v":2017},"Internet banking","Pay anyone same FI","Other",{"$f":"'Unauthorised transactions'!C35","v":0},{"$f":"'Unauthorised transactions'!D35","v":0}]
[{"$f":"Instructions!$D$16","v":"<please enter>"},{"$f":"Instructions!$D$20","v":"<please select>"},{"$f":"Instructions!$D$22","v":2017},"Internet banking","Pay anyone other FI","Malware",{"$f":"'Unauthorised transactions'!E30","v":0},{"$f":"'Unauthorised transactions'!F30","v":0}]
[{"$f":"Instructions!$D$16","v":"<please enter>"},{"$f":"Instructions!$D$20","v":"<please select>"},{"$f":"Instructions!$D$22","v":2017},"Internet banking","Pay anyone other FI","Phishing",{"$f":"'Unauthorised transactions'!E31","v":0},{"$f":"'Unauthorised transactions'!F31","v":0}]
[{"$f":"Instructions!$D$16","v":"<please enter>"},{"$f":"Instructions!$D$20","v":"<please select>"},{"$f":"Instructions!$D$22","v":2017},"Internet banking","Pay anyone other FI","ID Takeover",{"$f":"'Unauthorised transactions'!E32","v":0},{"$f":"'Unauthorised transactions'!F32","v":0}]
{"$rows_left_out":33}
{"sheet":"C. Other UTs","index":7,"n_rows":41,"n_cols":7,"rows_kept":41,"cut":false,"hidden":true,"merged":[]}
["Entity Name","Entity Type","Year","Channel","Transaction type","#","$"]
[{"$f":"Instructions!$D$16","v":"<please enter>"},{"$f":"Instructions!$D$20","v":"<please select>"},{"$f":"Instructions!$D$22","v":2017},"Mobile telco","Lost / Stolen",{"$f":"'Unauthorised transactions'!C47","v":0},{"$f":"'Unauthorised transactions'!D47","v":0}]
[{"$f":"Instructions!$D$16","v":"<please enter>"},{"$f":"Instructions!$D$20","v":"<please select>"},{"$f":"Instructions!$D$22","v":2017},"Mobile telco","Never Received",{"$f":"'Unauthorised transactions'!C48","v":0},{"$f":"'Unauthorised transactions'!D48","v":0}]
[{"$f":"Instructions!$D$16","v":"<please enter>"},{"$f":"Instructions!$D$20","v":"<please select>"},{"$f":"Instructions!$D$22","v":2017},"Mobile telco","Counterfeit / Skimming",{"$f":"'Unauthorised transactions'!C49","v":0},{"$f":"'Unauthorised transactions'!D49","v":0}]
[{"$f":"Instructions!$D$16","v":"<please enter>"},{"$f":"Instructions!$D$20","v":"<please select>"},{"$f":"Instructions!$D$22","v":2017},"Mobile telco","Fraudulent Application",{"$f":"'Unauthorised transactions'!C50","v":0},{"$f":"'Unauthorised transactions'!D50","v":0}]
[{"$f":"Instructions!$D$16","v":"<please enter>"},{"$f":"Instructions!$D$20","v":"<please select>"},{"$f":"Instructions!$D$22","v":2017},"Mobile telco","Malware",{"$f":"'Unauthorised transactions'!C51","v":0},{"$f":"'Unauthorised transactions'!D51","v":0}]
[{"$f":"Instructions!$D$16","v":"<please enter>"},{"$f":"Instructions!$D$20","v":"<please select>"},{"$f":"Instructions!$D$22","v":2017},"Mobile telco","Phishing",{"$f":"'Unauthorised transactions'!C52","v":0},{"$f":"'Unauthorised transactions'!D52","v":0}]
[{"$f":"Instructions!$D$16","v":"<please enter>"},{"$f":"Instructions!$D$20","v":"<please select>"},{"$f":"Instructions!$D$22","v":2017},"Mobile telco","ID Takeover",{"$f":"'Unauthorised transactions'!C53","v":0},{"$f":"'Unauthorised transactions'!D53","v":0}]
[{"$f":"Instructions!$D$16","v":"<please enter>"},{"$f":"Instructions!$D$20","v":"<please select>"},{"$f":"Instructions!$D$22","v":2017},"Mobile telco","Phone Porting",{"$f":"'Unauthorised transactions'!C54","v":0},{"$f":"'Unauthorised transactions'!D54","v":0}]
[{"$f":"Instructions!$D$16","v":"<please enter>"},{"$f":"Instructions!$D$20","v":"<please select>"},{"$f":"Instructions!$D$22","v":2017},"Mobile telco","System / Equipment malfunction",{"$f":"'Unauthorised transactions'!C55","v":0},{"$f":"'Unauthorised transactions'!D55","v":0}]
{"$rows_left_out":32}
{"sheet":"D. Complaints by timeframe","index":8,"n_rows":55,"n_cols":8,"rows_kept":55,"cut":false,"hidden":true,"merged":[]}
["Entity Name","Entity Type","Year","Time resolved","<5 days included?","Channel","Compensation?","Amount"]
[{"$f":"Instructions!$D$16","v":"<please enter>"},{"$f":"Instructions!$D$20","v":"<please select>"},{"$f":"Instructions!$D$22","v":2017},"Resolved under 21 Cal days",{"$f":"Complaints!$E$18","v":0},"Internet Banking","Compensation",{"$f":"Complaints!C11","v":0}]
[{"$f":"Instructions!$D$16","v":"<please enter>"},{"$f":"Instructions!$D$20","v":"<please select>"},{"$f":"Instructions!$D$22","v":2017},"Resolved under 21 Cal days",{"$f":"Complaints!$E$18","v":0},"Telephone Banking","Compensation",{"$f":"Complaints!E11","v":0}]
[{"$f":"Instructions!$D$16","v":"<please enter>"},{"$f":"Instructions!$D$20","v":"<please select>"},{"$f":"Instructions!$D$22","v":2017},"Resolved under 21 Cal days",{"$f":"Complaints!$E$18","v":0},"Mobile App Banking","Compensation",{"$f":"Complaints!G11","v":0}]
[{"$f":"Instructions!$D$16","v":"<please enter>"},{"$f":"Instructions!$D$20","v":"<please select>"},{"$f":"Instructions!$D$22","v":2017},"Resolved under 21 Cal days",{"$f":"Complaints!$E$18","v":0},"POS (Includes remote transactions)","Compensation",{"$f":"Complaints!I11","v":0}]
[{"$f":"Instructions!$D$16","v":"<please enter>"},{"$f":"Instructions!$D$20","v":"<please select>"},{"$f":"Instructions!$D$22","v":2017},"Resolved under 21 Cal days",{"$f":"Complaints!$E$18","v":0},"ATM","Compensation",{"$f":"Complaints!K11","v":0}]
[{"$f":"Instructions!$D$16","v":"<please enter>"},{"$f":"Instructions!$D$20","v":"<please select>"},{"$f":"Instructions!$D$22","v":2017},"Resolved under 21 Cal days",{"$f":"Complaints!$E$18","v":0},"Mobile telco network","Compensation",{"$f":"Complaints!M11","v":0}]
[{"$f":"Instructions!$D$16","v":"<please enter>"},{"$f":"Instructions!$D$20","v":"<please select>"},{"$f":"Instructions!$D$22","v":2017},"Resolved under 21 Cal days",{"$f":"Complaints!$E$18","v":0},"Internet Banking","Compensation",{"$f":"Complaints!O11","v":0}]
[{"$f":"Instructions!$D$16","v":"<please enter>"},{"$f":"Instructions!$D$20","v":"<please select>"},{"$f":"Instructions!$D$22","v":2017},"Resolved under 21 Cal days",{"$f":"Complaints!$E$18","v":0},"Face-to-fac e POS","Compensation",{"$f":"Complaints!Q11","v":0}]
[{"$f":"Instructions!$D$16","v":"<please enter>"},{"$f":"Instructions!$D$20","v":"<please select>"},{"$f":"Instructions!$D$22","v":2017},"Resolved under 21 Cal days",{"$f":"Complaints!$E$18","v":0},"Other","Compensation",{"$f":"Complaints!S11","v":0}]
{"$rows_left_out":46}
{"sheet":"E. Complaints by reason","index":9,"n_rows":37,"n_cols":7,"rows_kept":37,"cut":false,"hidden":true,"merged":[]}
["Entity Name","Entity Type","Year","Trans type","Chanel","Compensation","Amount"]
[{"$f":"Instructions!$D$16","v":"<please enter>"},{"$f":"Instructions!$D$20","v":"<please select>"},{"$f":"Instructions!$D$22","v":2017},"Fraudulent Transactions","Internet Banking","Compensation",{"$f":"Complaints!C25","v":0}]
[{"$f":"Instructions!$D$16","v":"<please enter>"},{"$f":"Instructions!$D$20","v":"<please select>"},{"$f":"Instructions!$D$22","v":2017},"Fraudulent Transactions","Telephone Banking","Compensation",{"$f":"Complaints!E25","v":0}]
[{"$f":"Instructions!$D$16","v":"<please enter>"},{"$f":"Instructions!$D$20","v":"<please select>"},{"$f":"Instructions!$D$22","v":2017},"Fraudulent Transactions","Mobile App Banking","Compensation",{"$f":"Complaints!G25","v":0}]
[{"$f":"Instructions!$D$16","v":"<please enter>"},{"$f":"Instructions!$D$20","v":"<please select>"},{"$f":"Instructions!$D$22","v":2017},"Fraudulent Transactions","POS (Includes remote transactions)","Compensation",{"$f":"Complaints!I25","v":0}]
[{"$f":"Instructions!$D$16","v":"<please enter>"},{"$f":"Instructions!$D$20","v":"<please select>"},{"$f":"Instructions!$D$22","v":2017},"Fraudulent Transactions","ATM","Compensation",{"$f":"Complaints!K25","v":0}]
[{"$f":"Instructions!$D$16","v":"<please enter>"},{"$f":"Instructions!$D$20","v":"<please select>"},{"$f":"Instructions!$D$22","v":2017},"Fraudulent Transactions","Mobile telco network","Compensation",{"$f":"Complaints!M25","v":0}]
[{"$f":"Instructions!$D$16","v":"<please enter>"},{"$f":"Instructions!$D$20","v":"<please select>"},{"$f":"Instructions!$D$22","v":2017},"Fraudulent Transactions","Internet Banking","Compensation",{"$f":"Complaints!O25","v":0}]
[{"$f":"Instructions!$D$16","v":"<please enter>"},{"$f":"Instructions!$D$20","v":"<please select>"},{"$f":"Instructions!$D$22","v":2017},"Fraudulent Transactions","Face-to-face POS","Compensation",{"$f":"Complaints!Q25","v":0}]
[{"$f":"Instructions!$D$16","v":"<please enter>"},{"$f":"Instructions!$D$20","v":"<please select>"},{"$f":"Instructions!$D$22","v":2017},"Fraudulent Transactions","Other","Compensation",{"$f":"Complaints!S25","v":0}]
{"$rows_left_out":28}
{"sheet":"F. Totals","index":10,"n_rows":14,"n_cols":7,"rows_kept":14,"cut":false,"hidden":true,"merged":[]}
["Entity Name","Entity Type","Year","Cat1","Cat2","#","$"]
[{"$f":"Instructions!$D$16","v":"<please enter>"},{"$f":"Instructions!$D$20","v":"<please select>"},{"$f":"Instructions!$D$22","v":2017},null,"POS",{"$f":"'Unauthorised transactions'!C19","v":0},{"$f":"'Unauthorised transactions'!D19","v":0}]
[{"$f":"Instructions!$D$16","v":"<please enter>"},{"$f":"Instructions!$D$20","v":"<please select>"},{"$f":"Instructions!$D$22","v":2017},null,"ATM",{"$f":"'Unauthorised transactions'!E19","v":0},{"$f":"'Unauthorised transactions'!F19","v":0}]
[{"$f":"Instructions!$D$16","v":"<please enter>"},{"$f":"Instructions!$D$20","v":"<please select>"},{"$f":"Instructions!$D$22","v":2017},"Internet Banking","Pay anyone same FI",{"$f":"'Unauthorised transactions'!C37","v":0},{"$f":"'Unauthorised transactions'!D37","v":0}]
[{"$f":"Instructions!$D$16","v":"<please enter>"},{"$f":"Instructions!$D$20","v":"<please select>"},{"$f":"Instructions!$D$22","v":2017},"Internet Banking","Pay anyone other FI",{"$f":"'Unauthorised transactions'!E37","v":0},{"$f":"'Unauthorised transactions'!F37","v":0}]
[{"$f":"Instructions!$D$16","v":"<please enter>"},{"$f":"Instructions!$D$20","v":"<please select>"},{"$f":"Instructions!$D$22","v":2017},"Internet Banking","BPAY",{"$f":"'Unauthorised transactions'!G37","v":0},{"$f":"'Unauthorised transactions'!H37","v":0}]
[{"$f":"Instructions!$D$16","v":"<please enter>"},{"$f":"Instructions!$D$20","v":"<please select>"},{"$f":"Instructions!$D$22","v":2017},"Mobile Application Banking","Pay anyone same FI",{"$f":"'Unauthorised transactions'!I37","v":0},{"$f":"'Unauthorised transactions'!J37","v":0}]
[{"$f":"Instructions!$D$16","v":"<please enter>"},{"$f":"Instructions!$D$20","v":"<please select>"},{"$f":"Instructions!$D$22","v":2017},"Mobile Application Banking","Pay anyone other FI",{"$f":"'Unauthorised transactions'!K37","v":0},{"$f":"'Unauthorised transactions'!L37","v":0}]
[{"$f":"Instructions!$D$16","v":"<please enter>"},{"$f":"Instructions!$D$20","v":"<please select>"},{"$f":"Instructions!$D$22","v":2017},"Mobile Application Banking","BPAY",{"$f":"'Unauthorised transactions'!M37","v":0},{"$f":"'Unauthorised transactions'!N37","v":0}]
[{"$f":"Instructions!$D$16","v":"<please enter>"},{"$f":"Instructions!$D$20","v":"<please select>"},{"$f":"Instructions!$D$22","v":2017},"Telephone Banking","BPAY",{"$f":"'Unauthorised transactions'!O37","v":0},{"$f":"'Unauthorised transactions'!P37","v":0}]
{"$rows_left_out":5}
{"sheet":"ABN check","index":11,"n_rows":19,"n_cols":14,"rows_kept":19,"cut":false,"hidden":true,"merged":[]}
["ABN",null,53004085616,null,null,{"$f":"Instructions!D18","v":"<please enter>"},{"$f":"LEN(F1)","v":14},null,null,null,null,null,1,"00000000"]
[{"$f":"Instructions!D18","v":"<please enter>"},null,null,null,null,null,null,null,null,null,null,null,2,"0000000"]
[{"$f":"A2-10000000000","v":{"$error":"#VALUE!"}},null,null,null,null,{"$f":"VLOOKUP(G1,$M$1:$N$9,2,0)&LEFT(F1,9)","v":{"$error":"#N/A"}},null,null,null,null,null,null,3,"000000"]
[null,null,null,null,null,null,null,null,null,null,null,null,4,"00000"]
[1,{"$f":"LEFT($A$3,1)","v":{"$error":"#VALUE!"}},10,{"$f":"B5*C5","v":{"$error":"#VALUE!"}},null,1,{"$f":"LEFT($F$3,1)","v":{"$error":"#N/A"}},8,{"$f":"H5*G5","v":{"$error":"#N/A"}},null,null,null,5,"0000"]
[2,{"$f":"MID($A$3,A6,1)","v":{"$error":"#VALUE!"}},1,{"$f":"B6*C6","v":{"$error":"#VALUE!"}},null,2,{"$f":"MID($F$3,F6,1)","v":{"$error":"#N/A"}},7,{"$f":"H6*G6","v":{"$error":"#N/A"}},null,null,null,6,"000"]
[3,{"$f":"MID($A$3,A7,1)","v":{"$error":"#VALUE!"}},3,{"$error":"#VALUE!"},null,3,{"$error":"#N/A"},6,{"$error":"#N/A"},null,null,null,7,"00"]
[4,{"$error":"#VALUE!"},5,{"$error":"#VALUE!"},null,4,{"$error":"#N/A"},5,{"$error":"#N/A"},null,null,null,8,"0"]
[5,{"$error":"#VALUE!"},7,{"$error":"#VALUE!"},null,5,{"$error":"#N/A"},4,{"$error":"#N/A"},null,null,null,9]
[6,{"$error":"#VALUE!"},9,{"$error":"#VALUE!"},null,6,{"$error":"#N/A"},3,{"$error":"#N/A"}]
{"$rows_left_out":9}